{"text_format":"1","workbook":"xlsx","n_sheets":11,"sheets":["Main","InputSort","RawInput","TuneLookup","DefaultBuilder","GraphBuild","V2_TuneBuilder","V3_TuneBuilder","4KV2_TuneBuilder","4KV3_TuneBuilder","SendIt"],"not_rendered":{"charts":18,"images":32,"macros":1,"external_links":1,"defined_names":10,"comments":0,"pivot_tables":0},"unopened":[],"bounds":{"document_bytes":16777216,"sheet_cells":100000,"rows_first":2000,"rows_last":500,"rows_between":2000,"halvings":0,"cell_chars":16384,"cell_head_chars":4096},"cells_cut":0,"cells_raw":0,"read":"whole","date_system":"1900"}

{"sheet":"Main","index":0,"n_rows":0,"n_cols":0,"rows_kept":0,"cut":false,"hidden":false,"merged":[]}

{"sheet":"InputSort","index":1,"n_rows":47,"n_cols":45,"rows_kept":47,"cut":false,"hidden":true,"merged":[]}
["{\"profileName\":\"7x012 vgt daily\"","vehicleName:\"V2 Dodge 1998-2002\"","settingsMap:{\"125\":\"84\"","133:\"114\"","128:\"94\"","127:\"90\"","111:\"50\"","139:\"25\"","19:\"0\"","116:\"68\"","17:\"2.9\"","118:\"71\"","112:\"10\"","22:\"40\"","131:\"106\"","61:\"1.5\"","115:\"67\"","62:\"30\"","129:\"98\"","126:\"86\"","114:\"66\"","136:\"120\"","121:\"76\"","140:\"27.9\"","130:\"102\"","119:\"72\"","85:\"1200\"","104:\"3500\"","60:\"50\"","138:\"20\"","113:\"66\"","124:\"82\"","122:\"78\"","135:\"120\"","132:\"110\"","59:\"4.9\"","15:\"8\"","134:\"118\"","110:\"0\"","120:\"74\"","137:\"17\"","123:\"80\"","18:\"100\"","141:\"29.9\"","117:\"70\"}}"]
[]
["{\"profileName\":\"7x012 vgt daily\"",{"$f":"IF(ISNUMBER(SEARCH(\"settingsMap\",$A$1)),1,0)","v":0}]
["vehicleName:\"V2 Dodge 1998-2002\""]
["settingsMap:{\"125\":\"84\""]
["133:\"114\""]
{"$rows_left_out":42}
{"sheet":"RawInput","index":2,"n_rows":200,"n_cols":26,"rows_kept":200,"cut":false,"hidden":true,"merged":[]}
[]
[null,null,null,null,null,{"$f":"IF(E3=\"{\"\"profileName\",1,0)","v":1}]
["{\"profileName\":\"7x012 vgt daily\"",{"$f":"RIGHT(A3,LEN(A3)-FIND(\":\",A3))","v":"\"7x012 vgt daily\""},{"$f":"IFERROR(MID(B3,SEARCH(\"\"\"\",B3)+1,SEARCH(\"^\",SUBSTITUTE(B3,\"\"\"\",\"^\",LEN(B3)-LEN(SUBSTITUTE(B3,\"\"\"\",\"\"))))-LEN(LEFT(B3,SEARCH(\"\"\"\",B3)+1))),\"\")","v":"7x012 vgt daily"},null,{"$f":"LEFT(A3,13)","v":"{\"profileName"},{"$f":"IF(ISNUMBER(SEARCH(\"profileName\",E3)),1,0)","v":1},null,null,{"$f":"V2_TuneBuilder!A1","v":"7x012 vgt daily"},null,null,{"$f":"V3_TuneBuilder!A1","v":"Daily"},null,null,{"$f":"'4KV2_TuneBuilder'!A1","v":"test4k"},null,null,{"$f":"'4KV3_TuneBuilder'!A1","v":"Daily"},null,{"$f":"IF(OR(F4=\"V2 Dodge 1998-2000\",F4=\"V2 Dodge 2001-2002\",F4=\"V2 Dodge 1998-2002\"),1,IF(OR(F4=\"V2 Quadzilla Only\",F4=\"V2 QUADZILLA-ONLY\"),2,IF(OR(F4=\"V2 Quadzilla Only 4k\",F4=\"V2 Dodge 1998-2002 4K\"),3,4)))","v":1},1,2,3,4,null,"\""]
["vehicleName:\"V2 Dodge 1998-2002\"",null,{"$f":"IFERROR(MID(A4,SEARCH(\"\"\"\",A4)+1,SEARCH(\"^\",SUBSTITUTE(A4,\"\"\"\",\"^\",LEN(A4)-LEN(SUBSTITUTE(A4,\"\"\"\",\"\"))))-LEN(LEFT(A4,SEARCH(\"\"\"\",A4)+1))),\"\")","v":"V2 Dodge 1998-2002"},null,null,"V2 Dodge 1998-2002",null,"Aid V2","V2","Combine","Aid V3","V3","Combine","Aid 4KV2","4KV2","Combine","Aid 4KV3","4KV3","Combine",null,"V2Build","V3Build","4KV2Build","4KV3Build",null,"\":\""]
["125:\"84\"",{"$f":" IFERROR(LEFT(A5,FIND(\":\",A5)-1),\"\")","v":"125"},"84",{"$f":"IFERROR(VALUE(B5),\"\")","v":125},{"$f":"IFERROR(VALUE(C5),\"\")","v":84},{"$f":"ISNUMBER(E5)","v":true},null,15,{"$f":"IF(V2_TuneBuilder!B2>15,15,IF(V2_TuneBuilder!B2<6,6,V2_TuneBuilder!B2))","v":12},{"$f":"$Z$3&H5&$Z$4&I5&$Z$3&$Z$5","v":"\"15\":\"12\","},15,{"$f":"IF(V3_TuneBuilder!B2>15,15,IF(V3_TuneBuilder!B2<6,6,V3_TuneBuilder!B2))","v":12},{"$f":"$Z$3&K5&$Z$4&L5&$Z$3&$Z$5","v":"\"15\":\"12\","},15,{"$f":"IF('4KV2_TuneBuilder'!B2>15,15,IF('4KV2_TuneBuilder'!B2<6,6,'4KV2_TuneBuilder'!B2))","v":12},{"$f":"$Z$3&N5&$Z$4&O5&$Z$3&$Z$5","v":"\"15\":\"12\","},15,{"$f":"IF('4KV3_TuneBuilder'!B2>15,15,IF('4KV3_TuneBuilder'!B2<6,6,'4KV3_TuneBuilder'!B2))","v":12},{"$f":"$Z$3&Q5&$Z$4&R5&$Z$3&$Z$5","v":"\"15\":\"12\","},null,{"$f":"$Z$6&I3&$Z$3&$Z$5&$Z$3&$Z$7&$Z$4&C4&$Z$3&$Z$8&J5&J6&J7&J8&J9&J10&J11&J12&J13&J14&J15&J16&J17&J18&J19&J20&J21&J22&J23&J24&J25&J26&J27&J28&J29&J30&J31&J32&J33&J34&J35&J36&J37&J38&J39&J40&J41&J42&J43&J44&J45&J46&J47&Z9","v":"{\"profileName\":\"7x012 vgt daily\",\"vehicleName\":\"V2 Dodge 1998-2002\",\"settingsMap\":{\"15\":\"12\",\"104\":\"3200\",\"111\":\"50\",\"85\":\"1800\",\"18\":\"100\",\"19\":\"10\",\"110\":\"10\",\"112\":\"5\",\"22\":\"38\",\"17\":\"2\",\"59\":\"2\",\"60\":\"100\",\"61\":\"2\",\"62\":\"30\",\"137\":\"15\",\"138\":\"18\",\"139\":\"21\",\"140\":\"23\",\"141\":\"26\",\"113\":\"101\",\"114\":\"103\",\"115\":\"105\",\"116\":\"107\",\"117\":\"110\",\"118\":\"113\",\"119\":\"116\",\"120\":\"119\",\"121\":\"122\",\"122\":\"125\",\"123\":\"128\",\"124\":\"131\",\"125\":\"134\",\"126\":\"137\",\"127\":\"140\",\"128\":\"143\",\"129\":\"146\",\"130\":\"149\",\"131\":\"150\",\"132\":\"150\",\"133\":\"150\",\"134\":\"150\",\"135\":\"150\",\"136\":\"150\"}}"},{"$f":"$Z$6&L3&$Z$3&$Z$5&$Z$3&$Z$7&$Z$4&$C$4&$Z$3&$Z$8&M5&M6&M7&M8&M9&M10&M11&M12&M13&M14&M15&M16&M17&M18&M19&M20&M21&M22&M23&M24&M25&M26&M27&M28&M29&M30&M31&M32&M33&M34&M35&M36&M37&M38&M39&M40&M41&M42&M43&M44&M45&M46&M47&M48&M49&M50&M51&M52&M53&M54&M55&M56&M57&M58&M59&M60&M61&M62&M63&M64&M65&M66&M67&M68&M69&M70&M71&M72&$Z$9","v":"{\"profileName\":\"Daily\",\"vehicleName\":\"V2 Dodge 1998-2002\",\"settingsMap\":{\"15\":\"12\",\"104\":\"3200\",\"111\":\"50\",\"85\":\"1800\",\"18\":\"100\",\"19\":\"10\",\"112\":\"5\",\"22\":\"38\",\"156\":\"4\",\"157\":\"8\",\"158\":\"12\",\"159\":\"16\",\"160\":\"20\",\"161\":\"24\",\"162\":\"28\",\"163\":\"32\",\"164\":\"36\",\"165\":\"40\",\"166\":\"44\",\"167\":\"48\",\"168\":\"52\",\"169\":\"56\",\"170\":\"60\",\"171\":\"64\",\"172\":\"68\",\"173\":\"72\",\"174\":\"76\",\"175\":\"80\",\"176\":\"84\",\"177\":\"88\",\"178\":\"92\",\"179\":\"96\",\"180\":\"100\",\"17\":\"2\",\"59\":\"2\",\"60\":\"100\",\"61\":\"2\",\"62\":\"5\",\"137\":\"15\",\"138\":\"18\",\"139\":\"21\",\"140\":\"23\",\"141\":\"26\",\"113\":\"101\",\"114\":\"103\",\"115\":\"105\",\"116\":\"107\",\"117\":\"110\",\"118\":\"113\",\"119\":\"116\",\"120\":\"119\",\"121\":\"122\",\"122\":\"125\",\"123\":\"128\",\"124\":\"131\",\"125\":\"134\",\"126\":\"137\",\"127\":\"140\",\"128\":\"143\",\"129\":\"146\",\"130\":\"149\",\"131\":\"150\",\"132\":\"150\",\"133\":\"150\",\"134\":\"150\",\"135\":\"150\",\"136\":\"150\"}}"},{"$f":"$Z$6&O3&$Z$3&$Z$5&$Z$3&$Z$7&$Z$4&$C$4&$Z$3&$Z$8&P5&P6&P7&P8&P9&P10&P11&P12&P13&P14&P15&P16&P17&P18&P19&P20&P21&P22&P23&P24&P25&P26&P27&P28&P29&P30&P31&P32&P33&P34&P35&P36&P37&P38&P39&P40&P41&P42&P43&P44&P45&P46&P47&P48&P49&P50&P51&P52&P53&P54&P55&P56&P57&P58&P59&P60&P61&P62&P63&P64&P65&P66&P67&P68&P69&P70&P71&P72&P73&P74&$Z$9","v":"{\"profileName\":\"test4k\",\"vehicleName\":\"V2 Dodge 1998-2002\",\"settingsMap\":{\"15\":\"12\",\"104\":\"4200\",\"111\":\"50\",\"85\":\"4400\",\"18\":\"100\",\"19\":\"10\",\"110\":\"10\",\"112\":\"5\",\"22\":\"38\",\"17\":\"2\",\"59\":\"2\",\"60\":\"100\",\"61\":\"2\",\"62\":\"30\",\"137\":\"15\",\"138\":\"18\",\"139\":\"21\",\"140\":\"23\",\"142\":\"24\",\"143\":\"25\",\"141\":\"26\",\"113\":\"101\",\"114\":\"103\",\"115\":\"105\",\"116\":\"107\",\"117\":\"110\",\"118\":\"113\",\"119\":\"116\",\"120\":\"119\",\"121\":\"122\",\"122\":\"125\",\"123\":\"128\",\"124\":\"131\",\"125\":\"134\",\"126\":\"137\",\"127\":\"140\",\"128\":\"143\",\"129\":\"146\",\"130\":\"149\",\"131\":\"150\",\"132\":\"150\",\"133\":\"150\",\"134\":\"150\",\"135\":\"150\",\"136\":\"150\",\"156\":\"0\",\"157\":\"0\",\"158\":\"0\",\"159\":\"0\",\"160\":\"0\",\"161\":\"0\",\"162\":\"0\",\"163\":\"0\",\"164\":\"0\",\"165\":\"0\",\"166\":\"0\",\"167\":\"0\",\"168\":\"0\",\"169\":\"0\",\"170\":\"0\",\"171\":\"0\",\"172\":\"0\",\"173\":\"0\",\"174\":\"0\",\"175\":\"0\",\"176\":\"0\",\"177\":\"0\",\"178\":\"0\",\"179\":\"0\",\"180\":\"0\"}}"},{"$f":"$Z$6&R3&$Z$3&$Z$5&$Z$3&$Z$7&$Z$4&$C$4&$Z$3&$Z$8&S5&S6&S7&S8&S9&S10&S11&S12&S13&S14&S15&S16&S17&S18&S19&S20&S21&S22&S23&S24&S25&S26&S27&S28&S29&S30&S31&S32&S33&S34&S35&S36&S37&S38&S39&S40&S41&S42&S43&S44&S45&S46&S47&S48&S49&S50&S51&S52&S53&S54&S55&S56&S57&S58&S59&S60&S61&S62&S63&S64&S65&S66&S67&S68&S69&S70&S71&S72&S73&S74&$Z$9","v":"{\"profileName\":\"Daily\",\"vehicleName\":\"V2 Dodge 1998-2002\",\"settingsMap\":{\"15\":\"12\",\"104\":\"4200\",\"111\":\"50\",\"85\":\"4400\",\"18\":\"100\",\"19\":\"10\",\"112\":\"5\",\"22\":\"38\",\"156\":\"4\",\"157\":\"8\",\"158\":\"12\",\"159\":\"16\",\"160\":\"20\",\"161\":\"24\",\"162\":\"28\",\"163\":\"32\",\"164\":\"36\",\"165\":\"40\",\"166\":\"44\",\"167\":\"48\",\"168\":\"52\",\"169\":\"56\",\"170\":\"60\",\"171\":\"64\",\"172\":\"68\",\"173\":\"72\",\"174\":\"76\",\"175\":\"80\",\"176\":\"84\",\"177\":\"88\",\"178\":\"92\",\"179\":\"96\",\"180\":\"100\",\"17\":\"2\",\"59\":\"2\",\"60\":\"100\",\"61\":\"2\",\"62\":\"5\",\"137\":\"15\",\"138\":\"18\",\"139\":\"21\",\"140\":\"23\",\"142\":\"24\",\"143\":\"25\",\"141\":\"50\",\"113\":\"101\",\"114\":\"103\",\"115\":\"105\",\"116\":\"107\",\"117\":\"110\",\"118\":\"113\",\"119\":\"116\",\"120\":\"119\",\"121\":\"122\",\"122\":\"125\",\"123\":\"128\",\"124\":\"131\",\"125\":\"134\",\"126\":\"137\",\"127\":\"140\",\"128\":\"143\",\"129\":\"146\",\"130\":\"149\",\"131\":\"150\",\"132\":\"150\",\"133\":\"150\",\"134\":\"150\",\"135\":\"150\",\"136\":\"150\",\"110\":\"0\"}}"}," ",","]
["133:\"114\"","133","114",{"$f":"IFERROR(VALUE(B6),\"\")","v":133},114,{"$f":"ISNUMBER(E6)","v":true},null,104,{"$f":"IF(V2_TuneBuilder!B3>3700,3700,IF(V2_TuneBuilder!B3<3200,3200,V2_TuneBuilder!B3))","v":3200},"\"104\":\"3200\",",104,{"$f":"IF(V3_TuneBuilder!B3>3700,3700,IF(V3_TuneBuilder!B3<3200,3200,V3_TuneBuilder!B3))","v":3200},"\"104\":\"3200\",",104,{"$f":"IF('4KV2_TuneBuilder'!B3>4400,4400,IF('4KV2_TuneBuilder'!B3<3400,3400,'4KV2_TuneBuilder'!B3))","v":4200},"\"104\":\"4200\",",104,{"$f":"IF('4KV3_TuneBuilder'!B3>4400,4400,IF('4KV3_TuneBuilder'!B3<3400,3400,'4KV3_TuneBuilder'!B3))","v":4200},"\"104\":\"4200\",",null," ",null,null,null,null,"{\"profileName\":\""]
{"$rows_left_out":195}
{"sheet":"TuneLookup","index":3,"n_rows":77,"n_cols":17,"rows_kept":77,"cut":false,"hidden":true,"merged":[[52,15,52,16],[0,15,0,16],[3,15,3,16],[5,15,5,16],[12,15,12,16],[38,15,38,16],[44,15,44,16]]}
["Imported Tune Parameters",null,null,"V2 Tune Parameters",null,null,"V3 Tune Parameters",null,null,"4k V2 Tune Parameters",null,null,"4k V3 Tune Parameters",null,null,"Tune Parameters"]
["Number of Power Levels",{"$f":"IFERROR(VLOOKUP($Q$2,RawInput!$D$5:$E$200,2,FALSE),0)","v":8},null,"Number of Power Levels",12,null,"Number of Power Levels",12,null,"Number of Power Levels",12,null,"Number of Power Levels",12,null,"Number of Power Levels",15]
["RPM Limit",{"$f":"IFERROR(VLOOKUP($Q$3,RawInput!$D$5:$E$200,2,FALSE),0)","v":3500},null,"RPM Limit",3200,null,"RPM Limit",3200,null,"RPM Limit",4200,null,"RPM Limit",4200,null,"RPM Limit",104]
["Valet Mode",null,null,"Valet Mode",null,null,"Valet Mode",null,null,"Valet Mode",null,null,"Valet Mode",null,null,"Valet Mode"]
["Maximum Valet Mode Power",{"$f":"IFERROR(VLOOKUP($Q$5,RawInput!$D$5:$E$200,2,FALSE),0)","v":50},null,"Maximum Valet Mode Power",50,null,"Maximum Valet Mode Power",50,null,"Maximum Valet Mode Power",50,null,"Maximum Valet Mode Power",50,null,"Maximum Valet Mode Power",111]
["Pump Tap Parameters List",null,null,"Pump Tap Parameters List",null,null,"Pump Tap Parameters List",null,null,"Pump Tap Parameters List",null,null,"Pump Tap Parameters List",null,null,"Pump Tap Parameters List"]
{"$rows_left_out":72}
{"sheet":"DefaultBuilder","index":4,"n_rows":51,"n_cols":52,"rows_kept":51,"cut":false,"hidden":true,"merged":[]}
[null,null,null,null,null,"All Inputs",null,"Testing",null,null,null,null,null,null,null,"Canbus Up or down",null,null,null,null,null,null,"Wire Tap Up Down",null,null,null,null,null,null,null,null,null,"Timing",null,null,null,null,null,null,"Timing Reduction",null,null,"Altitude","HorsePower","InjectorType","Low","Mid","High","Time","Scale","Reduce","Type"]
[null,null,null,null,null,"Inputs","Offset","Inputs","Offset","Inputs","Offset","Inputs","Offset","V2",null,"V3",null,"4KV2",null,"4KV3",null,"V3",null,"4KV3",null,"V2",null,"V3",null,"4KV2",null,"4KV3",null,"V2",null,"V3",null,"4KV2",null,"4KV3"]
[null,null,null,"TuneType",null,null,{"$f":"IF($D$4=\"Mild\",3,IF($D$4=\"Daily\",0,IF($D$4=\"Tow\",2,IF($D$4=\"Street\",-5,IF($D$4=\"Race\",-12,0)))))","v":0},null,{"$f":"IF($D$4=\"Mild\",3,IF($D$4=\"Daily\",0,IF($D$4=\"Tow\",2,IF($D$4=\"Street\",-5,IF($D$4=\"Race\",-12,0)))))","v":0},null,{"$f":"IF($D$4=\"Mild\",3,IF($D$4=\"Daily\",0,IF($D$4=\"Tow\",2,IF($D$4=\"Street\",-5,IF($D$4=\"Race\",-12,0)))))","v":0},null,{"$f":"IF($D$4=\"Mild\",3,IF($D$4=\"Daily\",0,IF($D$4=\"Tow\",2,IF($D$4=\"Street\",-5,IF($D$4=\"Race\",-12,0)))))","v":0},null,null,null,null,null,null,null,null,null,null,null,null,"1500RPM",2,"1500RPM",null,"1500RPM",null,"1500RPM",null,null,null,null,null,null,null,null,null,null,0,0,"SAC",-5,-5,-5,-2,10,0,"Mild"]
[null,null,null,"Daily","Altitude",4000,{"$f":"F4*0.0025","v":10},500,{"$f":"H4*0.0025","v":1.25},5000,{"$f":"J4*0.0025","v":12.5},600,{"$f":"L4*0.0025","v":1.5},"Low 1-9",null,"Low 0-7",0,"Low 0-7",null,"Low 0-7",null,"Low 0-7",null,"Low 1-9",null,"2000RPM",null,"2000RPM",null,"2000RPM",null,"2000RPM",null,"LPTR",2,"LPTR",2,"LPTR",null,"LPTR",null,null,250,25,"VCO",-4,-4,-4,-1,20,1,"Daily"]
[null,null,null,null,"Injector",175,{"$f":"IF(F5<151,F5*0.035,(IF(F5<226,F5*0.06,F5*0.09)))","v":10.5},75,{"$f":"IF(H5<151,H5*0.035,(IF(H5<226,H5*0.06,H5*0.09)))","v":2.6250000000000004},150,{"$f":"IF(J5<151,J5*0.035,(IF(J5<226,J5*0.06,J5*0.09)))","v":5.2500000000000009},0,{"$f":"IF(L5<151,L5*0.035,(IF(L5<226,L5*0.06,L5*0.09)))","v":0},"Mid 10-26",null,"Mid 8-15",null,"Mid 8-15",null,"Mid 8-15",null,"Mid 8-15",null,"Mid 10-26",null,"2500RPM",null,"2500RPM",null,"2500RPM",null,"2500RPM",null,"Scale",50,"Scale",100,"Scale",null,"Scale",null,null,500,50,null,-3,-3,-3,0,30,2,"Tow"]
[null,null,null,null,"Tip","VCO",{"$f":"IF(F6=\"VCO\",0,2)","v":0},"VCO",{"$f":"IF(H6=\"VCO\",0,2)","v":0},"SAC",{"$f":"IF(J6=\"VCO\",0,2)","v":2},"SAC",{"$f":"IF(L6=\"VCO\",0,2)","v":2},"High 26-40+",null,"High 16-30+",null,"High 16-30+",null,"High 16-30+",null,"High 16-30+",null,"High 26-40+",null,"3000RPM",null,"3000RPM",null,"3000RPM",null,"3000RPM",null,null,null,null,null,null,null,null,null,null,750,75,null,-2,-2,-2,1,40,3,"Street"]
{"$rows_left_out":46}
{"sheet":"GraphBuild","index":5,"n_rows":216,"n_cols":28,"rows_kept":216,"cut":false,"hidden":true,"merged":[]}
["V2"]
["TPS %",0.04,0.08,0.12,0.16,0.2,0.24,0.28000000000000003,0.32,0.36,0.4,0.44,0.48,0.52,0.56000000000000005,0.6,0.64,0.68,0.72,0.76,0.8,0.84,0.88,0.92,0.96,1]
[1,{"$f":"B$2*V3_TuneBuilder!$B13","v":0.16},{"$f":"C$2*V3_TuneBuilder!$B13","v":0.32},{"$f":"D$2*V3_TuneBuilder!$B13","v":0.48},{"$f":"E$2*V3_TuneBuilder!$B13","v":0.64},{"$f":"F$2*V3_TuneBuilder!$B13","v":0.8},{"$f":"G$2*V3_TuneBuilder!$B13","v":0.96},{"$f":"H$2*V3_TuneBuilder!$B13","v":1.1200000000000001},{"$f":"I$2*V3_TuneBuilder!$B13","v":1.28},{"$f":"J$2*V3_TuneBuilder!$B13","v":1.44},{"$f":"K$2*V3_TuneBuilder!$B13","v":1.6},{"$f":"L$2*V3_TuneBuilder!$B13","v":1.76},{"$f":"M$2*V3_TuneBuilder!$B13","v":1.92},{"$f":"N$2*V3_TuneBuilder!$B13","v":2.08},{"$f":"O$2*V3_TuneBuilder!$B13","v":2.2400000000000002},{"$f":"P$2*V3_TuneBuilder!$B13","v":2.4},{"$f":"Q$2*V3_TuneBuilder!$B13","v":2.56},{"$f":"R$2*V3_TuneBuilder!$B13","v":2.72},{"$f":"S$2*V3_TuneBuilder!$B13","v":2.88},{"$f":"T$2*V3_TuneBuilder!$B13","v":3.04},{"$f":"U$2*V3_TuneBuilder!$B13","v":3.2},{"$f":"V$2*V3_TuneBuilder!$B13","v":3.36},{"$f":"W$2*V3_TuneBuilder!$B13","v":3.52},{"$f":"X$2*V3_TuneBuilder!$B13","v":3.68},{"$f":"Y$2*V3_TuneBuilder!$B13","v":3.84},{"$f":"Z$2*V3_TuneBuilder!$B13","v":4}]
[2,{"$f":"B$2*V3_TuneBuilder!$B14","v":0.32},{"$f":"C$2*V3_TuneBuilder!$B14","v":0.64},{"$f":"D$2*V3_TuneBuilder!$B14","v":0.96},{"$f":"E$2*V3_TuneBuilder!$B14","v":1.28},{"$f":"F$2*V3_TuneBuilder!$B14","v":1.6},{"$f":"G$2*V3_TuneBuilder!$B14","v":1.92},{"$f":"H$2*V3_TuneBuilder!$B14","v":2.2400000000000002},{"$f":"I$2*V3_TuneBuilder!$B14","v":2.56},{"$f":"J$2*V3_TuneBuilder!$B14","v":2.88},{"$f":"K$2*V3_TuneBuilder!$B14","v":3.2},{"$f":"L$2*V3_TuneBuilder!$B14","v":3.52},{"$f":"M$2*V3_TuneBuilder!$B14","v":3.84},{"$f":"N$2*V3_TuneBuilder!$B14","v":4.16},{"$f":"O$2*V3_TuneBuilder!$B14","v":4.4800000000000004},{"$f":"P$2*V3_TuneBuilder!$B14","v":4.8},{"$f":"Q$2*V3_TuneBuilder!$B14","v":5.12},{"$f":"R$2*V3_TuneBuilder!$B14","v":5.44},{"$f":"S$2*V3_TuneBuilder!$B14","v":5.76},{"$f":"T$2*V3_TuneBuilder!$B14","v":6.08},{"$f":"U$2*V3_TuneBuilder!$B14","v":6.4},{"$f":"V$2*V3_TuneBuilder!$B14","v":6.72},{"$f":"W$2*V3_TuneBuilder!$B14","v":7.04},{"$f":"X$2*V3_TuneBuilder!$B14","v":7.36},{"$f":"Y$2*V3_TuneBuilder!$B14","v":7.68},{"$f":"Z$2*V3_TuneBuilder!$B14","v":8}]
[3,{"$f":"B$2*V3_TuneBuilder!$B15","v":0.48},{"$f":"C$2*V3_TuneBuilder!$B15","v":0.96},{"$f":"D$2*V3_TuneBuilder!$B15","v":1.44},{"$f":"E$2*V3_TuneBuilder!$B15","v":1.92},{"$f":"F$2*V3_TuneBuilder!$B15","v":2.4000000000000004},{"$f":"G$2*V3_TuneBuilder!$B15","v":2.88},{"$f":"H$2*V3_TuneBuilder!$B15","v":3.3600000000000003},{"$f":"I$2*V3_TuneBuilder!$B15","v":3.84},{"$f":"J$2*V3_TuneBuilder!$B15","v":4.32},{"$f":"K$2*V3_TuneBuilder!$B15","v":4.8000000000000007},{"$f":"L$2*V3_TuneBuilder!$B15","v":5.28},{"$f":"M$2*V3_TuneBuilder!$B15","v":5.76},{"$f":"N$2*V3_TuneBuilder!$B15","v":6.24},{"$f":"O$2*V3_TuneBuilder!$B15","v":6.7200000000000006},{"$f":"P$2*V3_TuneBuilder!$B15","v":7.1999999999999993},{"$f":"Q$2*V3_TuneBuilder!$B15","v":7.68},{"$f":"R$2*V3_TuneBuilder!$B15","v":8.16},{"$f":"S$2*V3_TuneBuilder!$B15","v":8.64},{"$f":"T$2*V3_TuneBuilder!$B15","v":9.120000000000001},{"$f":"U$2*V3_TuneBuilder!$B15","v":9.6000000000000014},{"$f":"V$2*V3_TuneBuilder!$B15","v":10.08},{"$f":"W$2*V3_TuneBuilder!$B15","v":10.56},{"$f":"X$2*V3_TuneBuilder!$B15","v":11.040000000000001},{"$f":"Y$2*V3_TuneBuilder!$B15","v":11.52},{"$f":"Z$2*V3_TuneBuilder!$B15","v":12}]
[4,{"$f":"B$2*V3_TuneBuilder!$B16","v":0.64},{"$f":"C$2*V3_TuneBuilder!$B16","v":1.28},{"$f":"D$2*V3_TuneBuilder!$B16","v":1.92},{"$f":"E$2*V3_TuneBuilder!$B16","v":2.56},{"$f":"F$2*V3_TuneBuilder!$B16","v":3.2},{"$f":"G$2*V3_TuneBuilder!$B16","v":3.84},{"$f":"H$2*V3_TuneBuilder!$B16","v":4.4800000000000004},{"$f":"I$2*V3_TuneBuilder!$B16","v":5.12},{"$f":"J$2*V3_TuneBuilder!$B16","v":5.76},{"$f":"K$2*V3_TuneBuilder!$B16","v":6.4},{"$f":"L$2*V3_TuneBuilder!$B16","v":7.04},{"$f":"M$2*V3_TuneBuilder!$B16","v":7.68},{"$f":"N$2*V3_TuneBuilder!$B16","v":8.32},{"$f":"O$2*V3_TuneBuilder!$B16","v":8.9600000000000009},{"$f":"P$2*V3_TuneBuilder!$B16","v":9.6},{"$f":"Q$2*V3_TuneBuilder!$B16","v":10.24},{"$f":"R$2*V3_TuneBuilder!$B16","v":10.88},{"$f":"S$2*V3_TuneBuilder!$B16","v":11.52},{"$f":"T$2*V3_TuneBuilder!$B16","v":12.16},{"$f":"U$2*V3_TuneBuilder!$B16","v":12.8},{"$f":"V$2*V3_TuneBuilder!$B16","v":13.44},{"$f":"W$2*V3_TuneBuilder!$B16","v":14.08},{"$f":"X$2*V3_TuneBuilder!$B16","v":14.72},{"$f":"Y$2*V3_TuneBuilder!$B16","v":15.36},{"$f":"Z$2*V3_TuneBuilder!$B16","v":16}]
{"$rows_left_out":211}
{"sheet":"V2_TuneBuilder","index":6,"n_rows":49,"n_cols":11,"rows_kept":49,"cut":false,"hidden":true,"merged":[[6,8,6,9]]}
["7x012 vgt daily",null,null,null,null,"RPM","Timing Input","Respective Timing",null,"Timing Calculator"]
["Number of Power Levels",12,null,null,null,"1500RPM",{"$f":"B20","v":15},{"$f":"GraphBuild!B92","v":16.420000000000002},null,"Load %",29]
["RPM Limit",3200,null,null,null,"2000RPM",{"$f":"B21","v":18},{"$f":"GraphBuild!B93","v":19.420000000000002},null,"PSI",0]
["Valet Mode",null,null,null,null,"2500RPM",{"$f":"B22","v":21},{"$f":"GraphBuild!B94","v":22.42},null,"TPS %",1]
["Maximum Valet Mode Power",50,null,null,null,"3000RPM",{"$f":"B23","v":23},{"$f":"GraphBuild!B95","v":24.42},null,"MPH",35]
["Pump Tap Parameters List",null,null,null,null,"MAX",{"$f":"B24","v":26},{"$f":"GraphBuild!B96","v":27.42},null,"RPM",2000]
{"$rows_left_out":44}
{"sheet":"V3_TuneBuilder","index":7,"n_rows":74,"n_cols":11,"rows_kept":74,"cut":false,"hidden":true,"merged":[]}
["Daily",null,null,null,null,"RPM","Timing Input","Timing Given Inputs",null,"Timing Calculator"]
["Number of Power Levels",12,null,null,null,"1500RPM",{"$f":"B45","v":15},{"$f":"GraphBuild!B106","v":13.58},null,"Load %",29]
["RPM Limit",3200,null,null,null,"2000RPM",{"$f":"B46","v":18},{"$f":"GraphBuild!B107","v":16.579999999999998},null,"PSI",0]
["Valet Mode",null,null,null,null,"2500RPM",{"$f":"B47","v":21},{"$f":"GraphBuild!B108","v":19.579999999999998},null,"TPS %",1]
["Maximum Valet Mode Power",50,null,null,null,"3000RPM",{"$f":"B48","v":23},{"$f":"GraphBuild!B109","v":21.58},null,"MPH",35]
["Pump Tap Parameters List",null,null,null,null,"MAX",{"$f":"B49","v":26},{"$f":"GraphBuild!B110","v":24.58},null,"RPM",2000]
{"$rows_left_out":69}
{"sheet":"4KV2_TuneBuilder","index":8,"n_rows":51,"n_cols":11,"rows_kept":51,"cut":false,"hidden":true,"merged":[]}
["test4k",null,null,null,null,"RPM","Timing Input","Timing Given Inputs",null,"Timing Calculator"]
["Number of Power Levels",12,null,null,null,"1500RPM",{"$f":"B20","v":15},{"$f":"GraphBuild!B136","v":13.5},null,"Load %",29]
["RPM Limit",4200,null,null,null,"2000RPM",18,{"$f":"GraphBuild!B137","v":16.5},null,"PSI",0]
["Valet Mode",null,null,null,null,"2500RPM",21,{"$f":"GraphBuild!B138","v":19.5},null,"TPS %",1]
["Maximum Valet Mode Power",50,null,null,null,"3000RPM",23,{"$f":"GraphBuild!B139","v":21.5},null,"MPH",35]
["Pump Tap Parameters List",null,null,null,null,"3500RPM",24,{"$f":"GraphBuild!B140","v":25.42},null,"RPM",2000]
{"$rows_left_out":46}
{"sheet":"4KV3_TuneBuilder","index":9,"n_rows":76,"n_cols":11,"rows_kept":76,"cut":false,"hidden":true,"merged":[]}
["Daily",null,null,null,null,"RPM","Timing Input","Timing Inputs",null,"Timing Calculator"]
["Number of Power Levels",12,null,null,null,"1500RPM",{"$f":"B45","v":15},{"$f":"GraphBuild!B136","v":13.5},null,"Load %",25]
["RPM Limit",4200,null,null,null,"2000RPM",18,{"$f":"GraphBuild!B137","v":16.5},null,"PSI",0]
["Valet Mode",null,null,null,null,"2500RPM",21,{"$f":"GraphBuild!B138","v":19.5},null,"TPS %",5]
["Maximum Valet Mode Power",50,null,null,null,"3000RPM",23,{"$f":"GraphBuild!B139","v":21.5},null,"MPH",35]
["Pump Tap Parameters List",null,null,null,null,"3500RPM",24,{"$f":"GraphBuild!B140","v":25.42},null,"RPM",2000]
{"$rows_left_out":71}
{"sheet":"SendIt","index":10,"n_rows":1,"n_cols":1,"rows_kept":1,"cut":false,"hidden":true,"merged":[]}
["{\"profileName\":\"Daily\",\"vehicleName\":\"V2 QUADZILLA-ONLY\",\"settingsMap\":{\"15\":\"6\",\"104\":\"3700\",\"111\":\"35\",\"85\":\"1800\",\"18\":\"100\",\"19\":\"0\",\"112\":\"0\",\"22\":\"40\",\"156\":\"1\",\"157\":\"2\",\"158\":\"3\",\"159\":\"4\",\"160\":\"5\",\"161\":\"6\",\"162\":\"8\",\"163\":\"10\",\"164\":\"15\",\"165\":\"20\",\"166\":\"25\",\"167\":\"30\",\"168\":\"35\",\"169\":\"40\",\"170\":\"50\",\"171\":\"60\",\"172\":\"70\",\"173\":\"80\",\"174\":\"90\",\"175\":\"95\",\"176\":\"100\",\"177\":\"100\",\"178\":\"100\",\"179\":\"100\",\"180\":\"100\",\"17\":\"2\",\"59\":\"5\",\"60\":\"80\",\"61\":\"1.5\",\"62\":\"30\",\"137\":\"17\",\"138\":\"18.5\",\"139\":\"22\",\"140\":\"24\",\"141\":\"12\",\"113\":\"84.5\",\"114\":\"85\",\"115\":\"86\",\"116\":\"87\",\"117\":\"88\",\"118\":\"89\",\"119\":\"90\",\"120\":\"92\",\"121\":\"94\",\"122\":\"96\",\"123\":\"100\",\"124\":\"104\",\"125\":\"109\",\"126\":\"115\",\"127\":\"120\",\"128\":\"125\",\"129\":\"130\",\"130\":\"130\",\"131\":\"130\",\"132\":\"130\",\"133\":\"130\",\"134\":\"130\",\"135\":\"130\",\"136\":\"130\"}}"]